{"text_format":"1","workbook":"xlsx","n_sheets":7,"sheets":["MONDAY","TUESDAY","WEDNESDAY","THURSDAY","FRIDAY","Weekly Summary","lookups"],"not_rendered":{"charts":0,"images":0,"macros":1,"external_links":0,"defined_names":2,"comments":0,"pivot_tables":0},"unopened":[],"bounds":{"document_bytes":16777216,"sheet_cells":100000,"rows_first":2000,"rows_last":500,"rows_between":2000,"halvings":0,"cell_chars":16384,"cell_head_chars":4096},"cells_cut":0,"cells_raw":0,"read":"whole","date_system":"1900"}

{"sheet":"MONDAY","index":0,"n_rows":113,"n_cols":24,"rows_kept":113,"cut":false,"hidden":false,"merged":[[1,5,1,10]]}
[null,"Weekending"]
[null,"Full Day reimbursement rate",null,null,null,"Interactions in Minutes"]
[null,"Name","ID","Diagnosis",null,"RN 1:1","RN Group","MSW 1:1","MSW Group","Other","Daily Total Minutes","Bill Code",null,null,null,null,null,null,null,null,3103,7963,7964,7965]
[1,null,null,null,null,null,null,null,null,null,{"$f":"SUM(F4:J4)","v":0},{"$f":"VLOOKUP(K4,lookups!$A$1:$B$363,2,FALSE)","v":"       -"},null,null,null,null,null,null,null,null,{"$f":"IF(L4=$U$3,1,\"\")","v":""},{"$f":"IF(L4=$V$3,1,\"\")","v":""},{"$f":"IF(L4=$W$3,1,\"\")","v":""},{"$f":"IF(L4=$X$3,1,\"\")","v":""}]
[{"$f":"A4+1","v":2},null,null,null,null,null,null,null,null,null,{"$f":"SUM(F5:J5)","v":0},{"$f":"VLOOKUP(K5,lookups!$A$1:$B$363,2,FALSE)","v":"       -"},null,null,null,null,null,null,null,null,{"$f":"IF(L5=$U$3,1,\"\")","v":""},{"$f":"IF(L5=$V$3,1,\"\")","v":""},{"$f":"IF(L5=$W$3,1,\"\")","v":""},{"$f":"IF(L5=$X$3,1,\"\")","v":""}]
[{"$f":"A5+1","v":3},null,null,null,null,null,null,null,null,null,0,{"$f":"VLOOKUP(K6,lookups!$A$1:$B$363,2,FALSE)","v":"       -"},null,null,null,null,null,null,null,null,"","","",""]
[4,null,null,null,null,null,null,null,null,null,0,{"$f":"VLOOKUP(K7,lookups!$A$1:$B$363,2,FALSE)","v":"       -"},null,null,null,null,null,null,null,null,"","","",""]
[5,null,null,null,null,null,null,null,null,null,0,{"$f":"VLOOKUP(K8,lookups!$A$1:$B$363,2,FALSE)","v":"       -"},null,null,null,null,null,null,null,null,"","","",""]
[6,null,null,null,null,null,null,null,null,null,0,{"$f":"VLOOKUP(K9,lookups!$A$1:$B$363,2,FALSE)","v":"       -"},null,null,null,null,null,null,null,null,"","","",""]
[7,null,null,null,null,null,null,null,null,null,0,{"$f":"VLOOKUP(K10,lookups!$A$1:$B$363,2,FALSE)","v":"       -"},null,null,null,null,null,null,null,null,"","","",""]
[8,null,null,null,null,null,null,null,null,null,0,{"$f":"VLOOKUP(K11,lookups!$A$1:$B$363,2,FALSE)","v":"       -"},null,null,null,null,null,null,null,null,"","","",""]
[9,null,null,null,null,null,null,null,null,null,0,{"$f":"VLOOKUP(K12,lookups!$A$1:$B$363,2,FALSE)","v":"       -"},null,null,null,null,null,null,null,null,"","","",""]
[10,null,null,null,null,null,null,null,null,null,0,{"$f":"VLOOKUP(K13,lookups!$A$1:$B$363,2,FALSE)","v":"       -"},null,null,null,null,null,null,null,null,"","","",""]
[11,null,null,null,null,null,null,null,null,null,0,{"$f":"VLOOKUP(K14,lookups!$A$1:$B$363,2,FALSE)","v":"       -"},null,null,null,null,null,null,null,null,"","","",""]
[12,null,null,null,null,null,null,null,null,null,0,{"$f":"VLOOKUP(K15,lookups!$A$1:$B$363,2,FALSE)","v":"       -"},null,null,null,null,null,null,null,null,"","","",""]
{"$rows_left_out":99}
{"sheet":"TUESDAY","index":1,"n_rows":113,"n_cols":24,"rows_kept":113,"cut":false,"hidden":false,"merged":[[1,5,1,10]]}
[null,"Weekending",{"$f":"MONDAY!C1","v":"00:00:00"}]
[null,null,null,null,null,"Interactions in Minutes"]
[null,"Name","ID","Diagnosis",null,"RN 1:1","RN Group","MSW 1:1","MSW Group","Other","Daily Total minuets","Bill Code",null,null,null,null,null,null,null,null,3103,7963,7964,7965]
[1,{"$f":"MONDAY!B4","v":0},{"$f":"MONDAY!C4","v":0},{"$f":"MONDAY!D4","v":0},null,null,null,null,null,null,{"$f":"SUM(F4:J4)","v":0},{"$f":"VLOOKUP(K4,lookups!$A$1:$B$363,2,FALSE)","v":"       -"},null,null,null,null,null,null,null,null,{"$f":"IF(L4=$U$3,1,\"\")","v":""},{"$f":"IF(L4=$V$3,1,\"\")","v":""},{"$f":"IF(L4=$W$3,1,\"\")","v":""},{"$f":"IF(L4=$X$3,1,\"\")","v":""}]
[{"$f":"A4+1","v":2},{"$f":"MONDAY!B5","v":0},{"$f":"MONDAY!C5","v":0},{"$f":"MONDAY!D5","v":0},null,null,null,null,null,null,{"$f":"SUM(F5:J5)","v":0},{"$f":"VLOOKUP(K5,lookups!$A$1:$B$363,2,FALSE)","v":"       -"},null,null,null,null,null,null,null,null,{"$f":"IF(L5=$U$3,1,\"\")","v":""},{"$f":"IF(L5=$V$3,1,\"\")","v":""},{"$f":"IF(L5=$W$3,1,\"\")","v":""},{"$f":"IF(L5=$X$3,1,\"\")","v":""}]
[{"$f":"A5+1","v":3},{"$f":"MONDAY!B6","v":0},{"$f":"MONDAY!C6","v":0},{"$f":"MONDAY!D6","v":0},null,null,null,null,null,null,0,{"$f":"VLOOKUP(K6,lookups!$A$1:$B$363,2,FALSE)","v":"       -"},null,null,null,null,null,null,null,null,"","","",""]
[4,{"$f":"MONDAY!B7","v":0},{"$f":"MONDAY!C7","v":0},{"$f":"MONDAY!D7","v":0},null,null,null,null,null,null,0,{"$f":"VLOOKUP(K7,lookups!$A$1:$B$363,2,FALSE)","v":"       -"},null,null,null,null,null,null,null,null,"","","",""]
[5,{"$f":"MONDAY!B8","v":0},{"$f":"MONDAY!C8","v":0},{"$f":"MONDAY!D8","v":0},null,null,null,null,null,null,0,{"$f":"VLOOKUP(K8,lookups!$A$1:$B$363,2,FALSE)","v":"       -"},null,null,null,null,null,null,null,null,"","","",""]
[6,{"$f":"MONDAY!B9","v":0},{"$f":"MONDAY!C9","v":0},{"$f":"MONDAY!D9","v":0},null,null,null,null,null,null,0,{"$f":"VLOOKUP(K9,lookups!$A$1:$B$363,2,FALSE)","v":"       -"},null,null,null,null,null,null,null,null,"","","",""]
[7,{"$f":"MONDAY!B10","v":0},{"$f":"MONDAY!C10","v":0},{"$f":"MONDAY!D10","v":0},null,null,null,null,null,null,0,{"$f":"VLOOKUP(K10,lookups!$A$1:$B$363,2,FALSE)","v":"       -"},null,null,null,null,null,null,null,null,"","","",""]
[8,{"$f":"MONDAY!B11","v":0},{"$f":"MONDAY!C11","v":0},{"$f":"MONDAY!D11","v":0},null,null,null,null,null,null,0,{"$f":"VLOOKUP(K11,lookups!$A$1:$B$363,2,FALSE)","v":"       -"},null,null,null,null,null,null,null,null,"","","",""]
[9,{"$f":"MONDAY!B12","v":0},{"$f":"MONDAY!C12","v":0},{"$f":"MONDAY!D12","v":0},null,null,null,null,null,null,0,{"$f":"VLOOKUP(K12,lookups!$A$1:$B$363,2,FALSE)","v":"       -"},null,null,null,null,null,null,null,null,"","","",""]
[10,{"$f":"MONDAY!B13","v":0},{"$f":"MONDAY!C13","v":0},{"$f":"MONDAY!D13","v":0},null,null,null,null,null,null,0,{"$f":"VLOOKUP(K13,lookups!$A$1:$B$363,2,FALSE)","v":"       -"},null,null,null,null,null,null,null,null,"","","",""]
[11,{"$f":"MONDAY!B14","v":0},{"$f":"MONDAY!C14","v":0},{"$f":"MONDAY!D14","v":0},null,null,null,null,null,null,0,{"$f":"VLOOKUP(K14,lookups!$A$1:$B$363,2,FALSE)","v":"       -"},null,null,null,null,null,null,null,null,"","","",""]
[12,{"$f":"MONDAY!B15","v":0},{"$f":"MONDAY!C15","v":0},{"$f":"MONDAY!D15","v":0},null,null,null,null,null,null,0,{"$f":"VLOOKUP(K15,lookups!$A$1:$B$363,2,FALSE)","v":"       -"},null,null,null,null,null,null,null,null,"","","",""]
{"$rows_left_out":99}
{"sheet":"WEDNESDAY","index":2,"n_rows":113,"n_cols":24,"rows_kept":113,"cut":false,"hidden":false,"merged":[[1,5,1,10]]}
[null,"Weekending",{"$f":"MONDAY!C1","v":"00:00:00"}]
[null,null,null,null,null,"Interactions in Minutes"]
[null,"Name","ID","Diagnosis",null,"RN 1:1","RN Group","MSW 1:1","MSW Group","Other","Daily Total minuets","Bill Code",null,null,null,null,null,null,null,null,3103,7963,7964,7965]
[1,{"$f":"MONDAY!B4","v":0},{"$f":"MONDAY!C4","v":0},{"$f":"MONDAY!D4","v":0},null,null,null,null,null,null,{"$f":"SUM(F4:J4)","v":0},{"$f":"VLOOKUP(K4,lookups!$A$1:$B$363,2,FALSE)","v":"       -"},null,null,null,null,null,null,null,null,{"$f":"IF(L4=$U$3,1,\"\")","v":""},{"$f":"IF(L4=$V$3,1,\"\")","v":""},{"$f":"IF(L4=$W$3,1,\"\")","v":""},{"$f":"IF(L4=$X$3,1,\"\")","v":""}]
[{"$f":"A4+1","v":2},{"$f":"MONDAY!B5","v":0},{"$f":"MONDAY!C5","v":0},{"$f":"MONDAY!D5","v":0},null,null,null,null,null,null,{"$f":"SUM(F5:J5)","v":0},{"$f":"VLOOKUP(K5,lookups!$A$1:$B$363,2,FALSE)","v":"       -"},null,null,null,null,null,null,null,null,{"$f":"IF(L5=$U$3,1,\"\")","v":""},{"$f":"IF(L5=$V$3,1,\"\")","v":""},{"$f":"IF(L5=$W$3,1,\"\")","v":""},{"$f":"IF(L5=$X$3,1,\"\")","v":""}]
[{"$f":"A5+1","v":3},{"$f":"MONDAY!B6","v":0},{"$f":"MONDAY!C6","v":0},{"$f":"MONDAY!D6","v":0},null,null,null,null,null,null,0,{"$f":"VLOOKUP(K6,lookups!$A$1:$B$363,2,FALSE)","v":"       -"},null,null,null,null,null,null,null,null,"","","",""]
[4,{"$f":"MONDAY!B7","v":0},{"$f":"MONDAY!C7","v":0},{"$f":"MONDAY!D7","v":0},null,null,null,null,null,null,0,{"$f":"VLOOKUP(K7,lookups!$A$1:$B$363,2,FALSE)","v":"       -"},null,null,null,null,null,null,null,null,"","","",""]
[5,{"$f":"MONDAY!B8","v":0},{"$f":"MONDAY!C8","v":0},{"$f":"MONDAY!D8","v":0},null,null,null,null,null,null,0,{"$f":"VLOOKUP(K8,lookups!$A$1:$B$363,2,FALSE)","v":"       -"},null,null,null,null,null,null,null,null,"","","",""]
[6,{"$f":"MONDAY!B9","v":0},{"$f":"MONDAY!C9","v":0},{"$f":"MONDAY!D9","v":0},null,null,null,null,null,null,0,{"$f":"VLOOKUP(K9,lookups!$A$1:$B$363,2,FALSE)","v":"       -"},null,null,null,null,null,null,null,null,"","","",""]
[7,{"$f":"MONDAY!B10","v":0},{"$f":"MONDAY!C10","v":0},{"$f":"MONDAY!D10","v":0},null,null,null,null,null,null,0,{"$f":"VLOOKUP(K10,lookups!$A$1:$B$363,2,FALSE)","v":"       -"},null,null,null,null,null,null,null,null,"","","",""]
[8,{"$f":"MONDAY!B11","v":0},{"$f":"MONDAY!C11","v":0},{"$f":"MONDAY!D11","v":0},null,null,null,null,null,null,0,{"$f":"VLOOKUP(K11,lookups!$A$1:$B$363,2,FALSE)","v":"       -"},null,null,null,null,null,null,null,null,"","","",""]
[9,{"$f":"MONDAY!B12","v":0},{"$f":"MONDAY!C12","v":0},{"$f":"MONDAY!D12","v":0},null,null,null,null,null,null,0,{"$f":"VLOOKUP(K12,lookups!$A$1:$B$363,2,FALSE)","v":"       -"},null,null,null,null,null,null,null,null,"","","",""]
[10,{"$f":"MONDAY!B13","v":0},{"$f":"MONDAY!C13","v":0},{"$f":"MONDAY!D13","v":0},null,null,null,null,null,null,0,{"$f":"VLOOKUP(K13,lookups!$A$1:$B$363,2,FALSE)","v":"       -"},null,null,null,null,null,null,null,null,"","","",""]
[11,{"$f":"MONDAY!B14","v":0},{"$f":"MONDAY!C14","v":0},{"$f":"MONDAY!D14","v":0},null,null,null,null,null,null,0,{"$f":"VLOOKUP(K14,lookups!$A$1:$B$363,2,FALSE)","v":"       -"},null,null,null,null,null,null,null,null,"","","",""]
[12,{"$f":"MONDAY!B15","v":0},{"$f":"MONDAY!C15","v":0},{"$f":"MONDAY!D15","v":0},null,null,null,null,null,null,0,{"$f":"VLOOKUP(K15,lookups!$A$1:$B$363,2,FALSE)","v":"       -"},null,null,null,null,null,null,null,null,"","","",""]
{"$rows_left_out":99}
{"sheet":"THURSDAY","index":3,"n_rows":113,"n_cols":24,"rows_kept":113,"cut":false,"hidden":false,"merged":[[1,5,1,10]]}
[null,"Weekending",{"$f":"MONDAY!C1","v":"00:00:00"}]
[null,null,null,null,null,"Interactions in Minutes"]
[null,"Name","ID","Diagnosis",null,"RN 1:1","RN Group","MSW 1:1","MSW Group","Other","Daily Total minuets","Bill Code",null,null,null,null,null,null,null,null,3103,7963,7964,7965]
[1,{"$f":"MONDAY!B4","v":0},{"$f":"MONDAY!C4","v":0},{"$f":"MONDAY!D4","v":0},null,null,null,null,null,null,{"$f":"SUM(F4:J4)","v":0},{"$f":"VLOOKUP(K4,lookups!$A$1:$B$363,2,FALSE)","v":"       -"},null,null,null,null,null,null,null,null,{"$f":"IF(L4=$U$3,1,\"\")","v":""},{"$f":"IF(L4=$V$3,1,\"\")","v":""},{"$f":"IF(L4=$W$3,1,\"\")","v":""},{"$f":"IF(L4=$X$3,1,\"\")","v":""}]
[{"$f":"A4+1","v":2},{"$f":"MONDAY!B5","v":0},{"$f":"MONDAY!C5","v":0},{"$f":"MONDAY!D5","v":0},null,null,null,null,null,null,{"$f":"SUM(F5:J5)","v":0},{"$f":"VLOOKUP(K5,lookups!$A$1:$B$363,2,FALSE)","v":"       -"},null,null,null,null,null,null,null,null,{"$f":"IF(L5=$U$3,1,\"\")","v":""},{"$f":"IF(L5=$V$3,1,\"\")","v":""},{"$f":"IF(L5=$W$3,1,\"\")","v":""},{"$f":"IF(L5=$X$3,1,\"\")","v":""}]
[{"$f":"A5+1","v":3},{"$f":"MONDAY!B6","v":0},{"$f":"MONDAY!C6","v":0},{"$f":"MONDAY!D6","v":0},null,null,null,null,null,null,0,{"$f":"VLOOKUP(K6,lookups!$A$1:$B$363,2,FALSE)","v":"       -"},null,null,null,null,null,null,null,null,"","","",""]
[4,{"$f":"MONDAY!B7","v":0},{"$f":"MONDAY!C7","v":0},{"$f":"MONDAY!D7","v":0},null,null,null,null,null,null,0,{"$f":"VLOOKUP(K7,lookups!$A$1:$B$363,2,FALSE)","v":"       -"},null,null,null,null,null,null,null,null,"","","",""]
[5,{"$f":"MONDAY!B8","v":0},{"$f":"MONDAY!C8","v":0},{"$f":"MONDAY!D8","v":0},null,null,null,null,null,null,0,{"$f":"VLOOKUP(K8,lookups!$A$1:$B$363,2,FALSE)","v":"       -"},null,null,null,null,null,null,null,null,"","","",""]
[6,{"$f":"MONDAY!B9","v":0},{"$f":"MONDAY!C9","v":0},{"$f":"MONDAY!D9","v":0},null,null,null,null,null,null,0,{"$f":"VLOOKUP(K9,lookups!$A$1:$B$363,2,FALSE)","v":"       -"},null,null,null,null,null,null,null,null,"","","",""]
[7,{"$f":"MONDAY!B10","v":0},{"$f":"MONDAY!C10","v":0},{"$f":"MONDAY!D10","v":0},null,null,null,null,null,null,0,{"$f":"VLOOKUP(K10,lookups!$A$1:$B$363,2,FALSE)","v":"       -"},null,null,null,null,null,null,null,null,"","","",""]
[8,{"$f":"MONDAY!B11","v":0},{"$f":"MONDAY!C11","v":0},{"$f":"MONDAY!D11","v":0},null,null,null,null,null,null,0,{"$f":"VLOOKUP(K11,lookups!$A$1:$B$363,2,FALSE)","v":"       -"},null,null,null,null,null,null,null,null,"","","",""]
[9,{"$f":"MONDAY!B12","v":0},{"$f":"MONDAY!C12","v":0},{"$f":"MONDAY!D12","v":0},null,null,null,null,null,null,0,{"$f":"VLOOKUP(K12,lookups!$A$1:$B$363,2,FALSE)","v":"       -"},null,null,null,null,null,null,null,null,"","","",""]
[10,{"$f":"MONDAY!B13","v":0},{"$f":"MONDAY!C13","v":0},{"$f":"MONDAY!D13","v":0},null,null,null,null,null,null,0,{"$f":"VLOOKUP(K13,lookups!$A$1:$B$363,2,FALSE)","v":"       -"},null,null,null,null,null,null,null,null,"","","",""]
[11,{"$f":"MONDAY!B14","v":0},{"$f":"MONDAY!C14","v":0},{"$f":"MONDAY!D14","v":0},null,null,null,null,null,null,0,{"$f":"VLOOKUP(K14,lookups!$A$1:$B$363,2,FALSE)","v":"       -"},null,null,null,null,null,null,null,null,"","","",""]
[12,{"$f":"MONDAY!B15","v":0},{"$f":"MONDAY!C15","v":0},{"$f":"MONDAY!D15","v":0},null,null,null,null,null,null,0,{"$f":"VLOOKUP(K15,lookups!$A$1:$B$363,2,FALSE)","v":"       -"},null,null,null,null,null,null,null,null,"","","",""]
{"$rows_left_out":99}
{"sheet":"FRIDAY","index":4,"n_rows":113,"n_cols":24,"rows_kept":113,"cut":false,"hidden":false,"merged":[[1,5,1,10]]}
[null,"Weekending",{"$f":"MONDAY!C1","v":"00:00:00"}]
[null,null,null,null,null,"Interactions in Minutes"]
[null,"Name","ID","Diagnosis",null,"RN 1:1","RN Group","MSW 1:1","MSW Group","Other","Daily Total minuets","Bill Code",null,null,null,null,null,null,null,null,3103,7963,7964,7965]
[1,{"$f":"MONDAY!B4","v":0},{"$f":"MONDAY!C4","v":0},{"$f":"MONDAY!D4","v":0},null,null,null,null,null,null,{"$f":"SUM(F4:J4)","v":0},{"$f":"VLOOKUP(K4,lookups!$A$1:$B$363,2,FALSE)","v":"       -"},null,null,null,null,null,null,null,null,{"$f":"IF(L4=$U$3,1,\"\")","v":""},{"$f":"IF(L4=$V$3,1,\"\")","v":""},{"$f":"IF(L4=$W$3,1,\"\")","v":""},{"$f":"IF(L4=$X$3,1,\"\")","v":""}]
[{"$f":"A4+1","v":2},{"$f":"MONDAY!B5","v":0},{"$f":"MONDAY!C5","v":0},{"$f":"MONDAY!D5","v":0},null,null,null,null,null,null,{"$f":"SUM(F5:J5)","v":0},{"$f":"VLOOKUP(K5,lookups!$A$1:$B$363,2,FALSE)","v":"       -"},null,null,null,null,null,null,null,null,{"$f":"IF(L5=$U$3,1,\"\")","v":""},{"$f":"IF(L5=$V$3,1,\"\")","v":""},{"$f":"IF(L5=$W$3,1,\"\")","v":""},{"$f":"IF(L5=$X$3,1,\"\")","v":""}]
[{"$f":"A5+1","v":3},{"$f":"MONDAY!B6","v":0},{"$f":"MONDAY!C6","v":0},{"$f":"MONDAY!D6","v":0},null,null,null,null,null,null,0,{"$f":"VLOOKUP(K6,lookups!$A$1:$B$363,2,FALSE)","v":"       -"},null,null,null,null,null,null,null,null,"","","",""]
[4,{"$f":"MONDAY!B7","v":0},{"$f":"MONDAY!C7","v":0},{"$f":"MONDAY!D7","v":0},null,null,null,null,null,null,0,{"$f":"VLOOKUP(K7,lookups!$A$1:$B$363,2,FALSE)","v":"       -"},null,null,null,null,null,null,null,null,"","","",""]
[5,{"$f":"MONDAY!B8","v":0},{"$f":"MONDAY!C8","v":0},{"$f":"MONDAY!D8","v":0},null,null,null,null,null,null,0,{"$f":"VLOOKUP(K8,lookups!$A$1:$B$363,2,FALSE)","v":"       -"},null,null,null,null,null,null,null,null,"","","",""]
[6,{"$f":"MONDAY!B9","v":0},{"$f":"MONDAY!C9","v":0},{"$f":"MONDAY!D9","v":0},null,null,null,null,null,null,0,{"$f":"VLOOKUP(K9,lookups!$A$1:$B$363,2,FALSE)","v":"       -"},null,null,null,null,null,null,null,null,"","","",""]
[7,{"$f":"MONDAY!B10","v":0},{"$f":"MONDAY!C10","v":0},{"$f":"MONDAY!D10","v":0},null,null,null,null,null,null,0,{"$f":"VLOOKUP(K10,lookups!$A$1:$B$363,2,FALSE)","v":"       -"},null,null,null,null,null,null,null,null,"","","",""]
[8,{"$f":"MONDAY!B11","v":0},{"$f":"MONDAY!C11","v":0},{"$f":"MONDAY!D11","v":0},null,null,null,null,null,null,0,{"$f":"VLOOKUP(K11,lookups!$A$1:$B$363,2,FALSE)","v":"       -"},null,null,null,null,null,null,null,null,"","","",""]
[9,{"$f":"MONDAY!B12","v":0},{"$f":"MONDAY!C12","v":0},{"$f":"MONDAY!D12","v":0},null,null,null,null,null,null,0,{"$f":"VLOOKUP(K12,lookups!$A$1:$B$363,2,FALSE)","v":"       -"},null,null,null,null,null,null,null,null,"","","",""]
[10,{"$f":"MONDAY!B13","v":0},{"$f":"MONDAY!C13","v":0},{"$f":"MONDAY!D13","v":0},null,null,null,null,null,null,0,{"$f":"VLOOKUP(K13,lookups!$A$1:$B$363,2,FALSE)","v":"       -"},null,null,null,null,null,null,null,null,"","","",""]
[11,{"$f":"MONDAY!B14","v":0},{"$f":"MONDAY!C14","v":0},{"$f":"MONDAY!D14","v":0},null,null,null,null,null,null,0,{"$f":"VLOOKUP(K14,lookups!$A$1:$B$363,2,FALSE)","v":"       -"},null,null,null,null,null,null,null,null,"","","",""]
[12,{"$f":"MONDAY!B15","v":0},{"$f":"MONDAY!C15","v":0},{"$f":"MONDAY!D15","v":0},null,null,null,null,null,null,0,{"$f":"VLOOKUP(K15,lookups!$A$1:$B$363,2,FALSE)","v":"       -"},null,null,null,null,null,null,null,null,"","","",""]
{"$rows_left_out":99}
{"sheet":"Weekly Summary","index":5,"n_rows":103,"n_cols":8,"rows_kept":103,"cut":false,"hidden":false,"merged":[]}
[null,"Weekending",{"$f":"MONDAY!C1","v":"00:00:00"}]
[]
[null,"LastName","ID","Monday","Tuesday","Wednesday","Thursday","Friday"]
[1,{"$f":"MONDAY!B4","v":0},{"$f":"MONDAY!C4","v":0},{"$f":"MONDAY!L4","v":"       -"},{"$f":"TUESDAY!L4","v":"       -"},{"$f":"WEDNESDAY!L4","v":"       -"},{"$f":"THURSDAY!L4","v":"       -"},{"$f":"FRIDAY!L4","v":"       -"}]
[{"$f":"A4+1","v":2},{"$f":"MONDAY!B5","v":0},{"$f":"MONDAY!C5","v":0},{"$f":"MONDAY!L5","v":"       -"},{"$f":"TUESDAY!L5","v":"       -"},{"$f":"WEDNESDAY!L5","v":"       -"},{"$f":"THURSDAY!L5","v":"       -"},{"$f":"FRIDAY!L5","v":"       -"}]
[{"$f":"A5+1","v":3},{"$f":"MONDAY!B6","v":0},{"$f":"MONDAY!C6","v":0},{"$f":"MONDAY!L6","v":"       -"},{"$f":"TUESDAY!L6","v":"       -"},{"$f":"WEDNESDAY!L6","v":"       -"},{"$f":"THURSDAY!L6","v":"       -"},{"$f":"FRIDAY!L6","v":"       -"}]
[4,{"$f":"MONDAY!B7","v":0},{"$f":"MONDAY!C7","v":0},{"$f":"MONDAY!L7","v":"       -"},{"$f":"TUESDAY!L7","v":"       -"},{"$f":"WEDNESDAY!L7","v":"       -"},{"$f":"THURSDAY!L7","v":"       -"},{"$f":"FRIDAY!L7","v":"       -"}]
[5,{"$f":"MONDAY!B8","v":0},{"$f":"MONDAY!C8","v":0},{"$f":"MONDAY!L8","v":"       -"},{"$f":"TUESDAY!L8","v":"       -"},{"$f":"WEDNESDAY!L8","v":"       -"},{"$f":"THURSDAY!L8","v":"       -"},{"$f":"FRIDAY!L8","v":"       -"}]
[6,{"$f":"MONDAY!B9","v":0},{"$f":"MONDAY!C9","v":0},{"$f":"MONDAY!L9","v":"       -"},{"$f":"TUESDAY!L9","v":"       -"},{"$f":"WEDNESDAY!L9","v":"       -"},{"$f":"THURSDAY!L9","v":"       -"},{"$f":"FRIDAY!L9","v":"       -"}]
[7,{"$f":"MONDAY!B10","v":0},{"$f":"MONDAY!C10","v":0},{"$f":"MONDAY!L10","v":"       -"},{"$f":"TUESDAY!L10","v":"       -"},{"$f":"WEDNESDAY!L10","v":"       -"},{"$f":"THURSDAY!L10","v":"       -"},{"$f":"FRIDAY!L10","v":"       -"}]
[8,{"$f":"MONDAY!B11","v":0},{"$f":"MONDAY!C11","v":0},{"$f":"MONDAY!L11","v":"       -"},{"$f":"TUESDAY!L11","v":"       -"},{"$f":"WEDNESDAY!L11","v":"       -"},{"$f":"THURSDAY!L11","v":"       -"},{"$f":"FRIDAY!L11","v":"       -"}]
[9,{"$f":"MONDAY!B12","v":0},{"$f":"MONDAY!C12","v":0},{"$f":"MONDAY!L12","v":"       -"},{"$f":"TUESDAY!L12","v":"       -"},{"$f":"WEDNESDAY!L12","v":"       -"},{"$f":"THURSDAY!L12","v":"       -"},{"$f":"FRIDAY!L12","v":"       -"}]
[10,{"$f":"MONDAY!B13","v":0},{"$f":"MONDAY!C13","v":0},{"$f":"MONDAY!L13","v":"       -"},{"$f":"TUESDAY!L13","v":"       -"},{"$f":"WEDNESDAY!L13","v":"       -"},{"$f":"THURSDAY!L13","v":"       -"},{"$f":"FRIDAY!L13","v":"       -"}]
[11,{"$f":"MONDAY!B14","v":0},{"$f":"MONDAY!C14","v":0},{"$f":"MONDAY!L14","v":"       -"},{"$f":"TUESDAY!L14","v":"       -"},{"$f":"WEDNESDAY!L14","v":"       -"},{"$f":"THURSDAY!L14","v":"       -"},{"$f":"FRIDAY!L14","v":"       -"}]
[12,{"$f":"MONDAY!B15","v":0},{"$f":"MONDAY!C15","v":0},{"$f":"MONDAY!L15","v":"       -"},{"$f":"TUESDAY!L15","v":"       -"},{"$f":"WEDNESDAY!L15","v":"       -"},{"$f":"THURSDAY!L15","v":"       -"},{"$f":"FRIDAY!L15","v":"       -"}]
{"$rows_left_out":89}
{"sheet":"lookups","index":6,"n_rows":363,"n_cols":2,"rows_kept":363,"cut":false,"hidden":false,"merged":[]}
[0,"       -"]
[1,"DNQ"]
[{"$f":"A2+1","v":2},"DNQ"]
[{"$f":"A3+1","v":3},"DNQ"]
[4,"DNQ"]
[5,7963]
[6,7963]
[7,7963]
[8,7963]
[9,7963]
[10,7963]
[11,7964]
[12,7964]
[13,7964]
[14,7964]
{"$rows_left_out":348}